Target
Growth hormone secretagogue receptor type 1
Ligand
BDBM50073034
Substrate
Meas. Tech.
ChEBML_173122
EC50
2.9±n/a nM
Citation
 Yang, LMorriello, GPrendergast, KCheng, KJacks, TChan, WWSchleim, KDSmith, RGPatchett, AA Potent 3-spiropiperidine growth hormone secretagogues. Bioorg Med Chem Lett 8:107-12 (1999)  
Target
Name:
Growth hormone secretagogue receptor type 1
Synonyms:
GH-releasing peptide receptor GHS-R Ghrelin receptor Growth hormone secretagogue receptor type 1
Type:
PROTEIN
Mol. Mass.:
40970.19
Organism:
Rattus norvegicus
Description:
ChEMBL_11556
Residue:
364
  
Inhibitor
Name:
BDBM50073034
Synonyms:
1N-[1-(1H-3-indolylmethyl)-2-oxo-2-spiro[3,4-dihydro-2H-chromene-2,3'-(hexahydropyridine)]-1-yl-(1R)-ethyl]-2-amino-2-methylpropanamide | CHEMBL274340
Type:
Small organic molecule
Emp. Form.:
C28H34N4O3
Mol. Mass.:
474.5946
SMILES:
CC(C)(N)C(=O)N[C@H](Cc1c[nH]c2ccccc12)C(=O)N1CCCC2(CCc3ccccc3O2)C1
: