Target
Glucagon-like peptide 1 receptor
Ligand
BDBM50393572
Substrate
Meas. Tech.
ChEMBL_1875038 (CHEMBL4376327)
EC50
203±n/a nM
Citation
 Menezes, JCJMDSDiederich, MF Natural dimers of coumarin, chalcones, and resveratrol and the link between structure and pharmacology. Eur J Med Chem 182:0 (2019)  
Target
Name:
Glucagon-like peptide 1 receptor
Synonyms:
GLP-1 receptor GLP-1R GLP1R_HUMAN Glucagon-like peptide 1 receptor (GLP-1)
Type:
Enzyme
Mol. Mass.:
53035.78
Organism:
Homo sapiens (Human)
Description:
P43220
Residue:
463
  
Inhibitor
Name:
BDBM50393572
Synonyms:
CHEMBL2158488
Type:
Small organic molecule
Emp. Form.:
C52H48N4O14S2
Mol. Mass.:
1017.086
SMILES:
COc1cc(ccc1OC(=O)c1cccs1)[C@H]1[C@@](NC(=O)c2ccc(NC(=O)C(C)C)cc2)([C@@H](c2ccc(OC(=O)c3cccs3)c(OC)c2)[C@]1(NC(=O)c1ccc(NC(=O)C(C)C)cc1)C(O)=O)C(O)=O
: