Target
cGMP-specific 3',5'-cyclic phosphodiesterase
Ligand
BDBM50073698
Substrate
Meas. Tech.
ChEBML_155190
IC50
30±n/a nM
Citation
 Ho, GDSilverman, LBercovici, APuchalski, CTulshian, DXia, YCzarniecki, MGreen, MCleven, RZhang, HFawzi, A Synthesis and evaluation of potent and selective c-GMP phosphodiesterase inhibitors. Bioorg Med Chem Lett 9:7-12 (1999)  
Target
Name:
cGMP-specific 3',5'-cyclic phosphodiesterase
Synonyms:
PDE5 PDE5A_BOVIN | Phosphodiesterase 5A
Type:
PROTEIN
Mol. Mass.:
98615.45
Organism:
Bos taurus
Description:
ChEMBL_155186
Residue:
865
  
Inhibitor
Name:
BDBM50073698
Synonyms:
5-methyl-2-octyl-(6aR,9aS)-3,4,5,8-tetrahydrocyclopenta[4,5]imidazo[2,1-b]purin-4-one | CHEMBL277317
Type:
Small organic molecule
Emp. Form.:
C18H27N5O
Mol. Mass.:
329.4399
SMILES:
CCCCCCCc1nc2N3[C@H]4CCC[C@H]4N=C3N(C)C(=O)c2[nH]1
: