Target
cGMP-inhibited 3',5'-cyclic phosphodiesterase 3A/3B
Ligand
BDBM50073698
Substrate
Meas. Tech.
ChEMBL_156746 (CHEMBL761468)
IC50
7000±n/a nM
Citation
 Ho, GDSilverman, LBercovici, APuchalski, CTulshian, DXia, YCzarniecki, MGreen, MCleven, RZhang, HFawzi, A Synthesis and evaluation of potent and selective c-GMP phosphodiesterase inhibitors. Bioorg Med Chem Lett 9:7-12 (1999)  
Target
Name:
cGMP-inhibited 3',5'-cyclic phosphodiesterase 3A/3B
Synonyms:
Phosphodiesterase (PDE3) Phosphodiesterase 3 (PDE3) | cGMP-inhibited 3',5'-cyclic phosphodiesterase A/B
Type:
Mol. Mass.:
Description:
ASSAY_ID of ChEMBL is 156458
Components:
This complex has 2 components.
Component 1
Name:
cGMP-inhibited 3',5'-cyclic phosphodiesterase 3B
Synonyms:
CGI-PDE B CGIPDE1 PDE3B Phosphodiesterase 3B Phosphodiesterase Type 3 (PDE3B) cGMP-inhibited 3,5-cyclic phosphodiesterase B
Type:
Enzyme
Mol. Mass.:
124318.95
Organism:
Homo sapiens (Human)
Description:
PDE3B was generated from the full-length recombinant human clone transfected into Sf9 cells.
Residue:
1112
  
Component 2
Name:
cGMP-inhibited 3',5'-cyclic phosphodiesterase 3A
Synonyms:
3',5'-cyclic phosphodiesterase Cyclic GMP-inhibited phosphodiesterase A PDE3A_HUMAN Phosphodiesterase 3 (PDE3) Phosphodiesterase 3A Phosphodiesterase 3A (PDE3A1) cGMP-inhibited 3',5'-cyclic phosphodiesterase A | cGMP-inhibited 3,5-cyclic phosphodiesterase A
Type:
Enzyme
Mol. Mass.:
124966.46
Organism:
Homo sapiens (Human)
Description:
Q14432
Residue:
1141
  
Inhibitor
Name:
BDBM50073698
Synonyms:
5-methyl-2-octyl-(6aR,9aS)-3,4,5,8-tetrahydrocyclopenta[4,5]imidazo[2,1-b]purin-4-one | CHEMBL277317
Type:
Small organic molecule
Emp. Form.:
C18H27N5O
Mol. Mass.:
329.4399
SMILES:
CCCCCCCc1nc2N3[C@H]4CCC[C@H]4N=C3N(C)C(=O)c2[nH]1
: