Target
Calcium/calmodulin-dependent protein kinase type 1B
Ligand
BDBM50519662
Substrate
Meas. Tech.
ChEMBL_1877763 (CHEMBL4379157)
IC50
>10000±n/a nM
Citation
 Zhao, LLi, YWang, YQiao, ZMiao, ZYang, JHuang, LTian, CLi, LChen, DYang, S Discovery of 4 J Med Chem 62:10691-10710 (2019)  
Target
Name:
Calcium/calmodulin-dependent protein kinase type 1B
Synonyms:
CaM kinase I beta CaM-KI beta Calcium/calmodulin-dependent protein kinase type 1B PNCK | Pregnancy up-regulated non-ubiquitously-expressed CaM kinase
Type:
PROTEIN
Mol. Mass.:
38501.47
Organism:
Homo sapiens (Human)
Description:
ChEMBL_109914
Residue:
343
  
Inhibitor
Name:
BDBM50519662
Synonyms:
CHEMBL4438748
Type:
Small organic molecule
Emp. Form.:
C26H23N3O5
Mol. Mass.:
457.4779
SMILES:
CN(C)c1ccc(cc1)C(=O)Nc1cccc(NC(=O)COc2ccc3c(c2)occc3=O)c1
: