Target
Receptor-type tyrosine-protein kinase FLT3
Ligand
BDBM50363397
Substrate
Meas. Tech.
ChEMBL_1878178 (CHEMBL4379572)
IC50
82±n/a nM
Citation
 Lin, WHWu, SYYeh, TKChen, CTSong, JSShiao, HYKuo, CCHsu, TLu, CTWang, PCWu, TSPeng, YHLin, HYChen, CPWeng, YLKung, FCWu, MHSu, YCHuang, KWChou, LHHsueh, CCYen, KJKuo, PCHuang, CLChen, LTShih, CTsai, HJJiaang, WT Identification of a Multitargeted Tyrosine Kinase Inhibitor for the Treatment of Gastrointestinal Stromal Tumors and Acute Myeloid Leukemia. J Med Chem 62:11135-11150 (2019)  
Target
Name:
Receptor-type tyrosine-protein kinase FLT3
Synonyms:
CD135 FL cytokine receptor FLK2 FLT3 Fetal liver kinase-2 Fms-like tyrosine kinase 3 (Flt-3) STK-1 Stem cell tyrosine kinase 1
Type:
Enzyme
Mol. Mass.:
112888.62
Organism:
Homo sapiens (Human)
Description:
P36888
Residue:
993
  
Inhibitor
Name:
BDBM50363397
Synonyms:
CHEMBL1946170 US10183928, Regorafenib US10227329, Compound Regorafenib US10584114, Compound Regorafenib US11279688, Compound Regorafenib
Type:
Small organic molecule
Emp. Form.:
C21H15ClF4N4O3
Mol. Mass.:
482.815
SMILES:
CNC(=O)c1cc(Oc2ccc(NC(=O)Nc3ccc(Cl)c(c3)C(F)(F)F)c(F)c2)ccn1
: