Target
5-hydroxytryptamine receptor 1B
Ligand
BDBM50074175
Substrate
Meas. Tech.
ChEMBL_1616 (CHEMBL616641)
IC50
93±n/a nM
Citation
 Sternfeld, FGuiblin, ARJelley, RAMatassa, VGReeve, AJHunt, PABeer, MSHeald, AStanton, JASohal, BWatt, APStreet, LJ Synthesis and serotonergic activity of 3-[2-(pyrrolidin-1-yl)ethyl]indoles: potent agonists for the h5-HT1D receptor with high selectivity over the h5-HT1B receptor. J Med Chem 42:677-90 (1999)  
Target
Name:
5-hydroxytryptamine receptor 1B
Synonyms:
5-HT-1B 5-HT1B 5HT1B_HUMAN HTR1DB Serotonin (5-HT) receptor Serotonin Receptor 1B
Type:
G Protein-Coupled Receptor (GPCR)
Mol. Mass.:
43579.17
Organism:
Homo sapiens (Human)
Description:
Receptor binding assays were performed using human clone stably expressed in CHO cells
Residue:
390
  
Inhibitor
Name:
BDBM50074175
Synonyms:
(R)-1-[2-(5-[1,2,4]Triazol-4-yl-1H-indol-3-yl)-ethyl]-pyrrolidin-3-ol | CHEMBL349528
Type:
Small organic molecule
Emp. Form.:
C16H19N5O
Mol. Mass.:
297.355
SMILES:
O[C@@H]1CCN(CCc2c[nH]c3ccc(cc23)-n2cnnc2)C1
: