Target
Cannabinoid receptor 1
Ligand
BDBM50074325
Substrate
Meas. Tech.
ChEMBL_46641 (CHEMBL658897)
Ki
1120±n/a nM
Citation
 Lan, RLiu, QFan, PLin, SFernando, SRMcCallion, DPertwee, RMakriyannis, A Structure-activity relationships of pyrazole derivatives as cannabinoid receptor antagonists. J Med Chem 42:769-76 (1999)  
Target
Name:
Cannabinoid receptor 1
Synonyms:
Brain-type cannabinoid receptor CB-R CNR1_RAT Cannabinoid receptor Cnr1 | Skr6
Type:
G Protein-Coupled Receptor (GPCR)
Mol. Mass.:
52856.55
Organism:
Rattus norvegicus (rat)
Description:
P20272
Residue:
473
  
Inhibitor
Name:
BDBM50074325
Synonyms:
5-(4-Bromo-phenyl)-1-(2,4-dichloro-phenyl)-4-methyl-1H-pyrazole-3-carboxylic acid (2-hydroxy-ethyl)-amide | CHEMBL285486
Type:
Small organic molecule
Emp. Form.:
C19H16BrCl2N3O2
Mol. Mass.:
469.159
SMILES:
Cc1c(nn(c1-c1ccc(Br)cc1)-c1ccc(Cl)cc1Cl)C(=O)NCCO
: