Target
MAP kinase-interacting serine/threonine-protein kinase 2
Ligand
BDBM31085
Substrate
Meas. Tech.
ChEMBL_1879585 (CHEMBL4380979)
IC50
20±n/a nM
Citation
 Kwiatkowski, JLiu, BPang, SAhmad, NHBWang, GPoulsen, AYang, HPoh, YRTee, DHYOng, ERetna, PDinie, NKwek, PWee, JLKManoharan, VLow, CBSeah, PGPendharkar, VSangthongpitag, KJoy, JBaburajendran, NJansson, AENacro, KHill, JKeller, THHung, AW Stepwise Evolution of Fragment Hits against MAPK Interacting Kinases 1 and 2. J Med Chem 63:621-637 (2020)  
Target
Name:
MAP kinase-interacting serine/threonine-protein kinase 2
Synonyms:
GPRK7 MAP kinase-interacting serine/threonine-protein kinase 2 (MKNK2) MAP-kinase interacting kinase 2 (MNK2) MKNK2_HUMAN | MNK2
Type:
Protein
Mol. Mass.:
51870.79
Organism:
Homo sapiens (Human)
Description:
Q9HBH9
Residue:
465
  
Inhibitor
Name:
BDBM31085
Synonyms:
1-[4-[(4-ethyl-1-piperazinyl)methyl]-3-(trifluoromethyl)phenyl]-3-[4-[[6-(methylamino)-4-pyrimidinyl]oxy]phenyl]urea 1-[4-[(4-ethylpiperazino)methyl]-3-(trifluoromethyl)phenyl]-3-[4-[6-(methylamino)pyrimidin-4-yl]oxyphenyl]urea cid_11409972
Type:
Small organic molecule
Emp. Form.:
C26H30F3N7O2
Mol. Mass.:
529.5573
SMILES:
CCN1CCN(Cc2ccc(NC(=O)Nc3ccc(Oc4cc(NC)ncn4)cc3)cc2C(F)(F)F)CC1
: