Target
Neutrophil cytosol factor 1
Ligand
BDBM14322
Substrate
Meas. Tech.
ChEMBL_1879631 (CHEMBL4381025)
Ki
428000±n/a nM
Citation
 Solbak, SMØZang, JNarayanan, DHøj, LJBucciarelli, SSoftley, CMeier, SLangkilde, AEGotfredsen, CHSattler, MBach, A Developing Inhibitors of the p47phox-p22phox Protein-Protein Interaction by Fragment-Based Drug Discovery. J Med Chem 63:1156-1177 (2020)  
Target
Name:
Neutrophil cytosol factor 1
Synonyms:
47 kDa autosomal chronic granulomatous disease protein NCF-1 NCF1 NOXO2 Neutrophil cytosol factor 1 Nox-organizing protein 2 SH3PXD1A | p47-phox
Type:
PROTEIN
Mol. Mass.:
44694.41
Organism:
Homo sapiens
Description:
ChEMBL_103757
Residue:
390
  
Inhibitor
Name:
BDBM14322
Synonyms:
2-Aminoquinoline 1 CHEMBL61236 Quinolin-2-amine | fragment 2 (J. med. chem.,50,1116)
Type:
Small organic molecule
Emp. Form.:
C9H8N2
Mol. Mass.:
144.1732
SMILES:
Nc1ccc2ccccc2n1
: