Target
Nicotinic acetylcholine receptor alpha9/alpha10
Ligand
BDBM50520486
Substrate
Meas. Tech.
ChEMBL_1880461 (CHEMBL4381855)
IC50
6.1±n/a nM
Citation
 Xu, PKaas, QWu, YZhu, XLi, XHarvey, PJZhangsun, DCraik, DJLuo, S Structure and Activity Studies of Disulfide-Deficient Analogues of ?O-Conotoxin GeXIVA. J Med Chem 63:1564-1575 (2020)  
Target
Name:
Nicotinic acetylcholine receptor alpha9/alpha10
Synonyms:
Neuronal acetylcholine receptor subunit alpha-10/alpha-9
Type:
Mol. Mass.:
Description:
ASSAY_ID of ChEMBL is 2193071
Components:
This complex has 2 components.
Component 1
Name:
Neuronal acetylcholine receptor subunit alpha-9
Synonyms:
ACHA9_RAT Cholinergic, Nicotinic Muscle NACHR alpha 9 Nicotinic acetylcholine receptor subunit alpha 9
Type:
Enzyme Catalytic Domain
Mol. Mass.:
54522.69
Organism:
RAT
Description:
Cholinergic, Nicotinic Muscle 0 RAT::P43144
Residue:
479
  
Component 2
Name:
Neuronal acetylcholine receptor subunit alpha-10
Synonyms:
ACH10_RAT Neuronal acetylcholine receptor protein alpha-10 subunit | Nicotinic acetylcholine receptor alpha9/alpha10
Type:
PROTEIN
Mol. Mass.:
49830.54
Organism:
Rattus norvegicus
Description:
ChEMBL_143222
Residue:
447
  
Inhibitor
Name:
BDBM50520486
Synonyms:
CHEMBL4460411
Type:
Small organic molecule
Emp. Form.:
C139H231N55O43
Mol. Mass.:
3360.6641
SMILES:
CC[C@H](C)[C@H](NC(=O)[C@H](CCCNC(N)=N)NC(=O)[C@H](CCCNC(N)=N)NC(=O)[C@H](CO)NC(=O)[C@H](Cc1ccc(O)cc1)NC(=O)[C@H](CCCNC(N)=N)NC(=O)[C@H](CCCNC(N)=N)NC(=O)[C@H](CCCNC(N)=N)NC(=O)[C@H](CCCNC(N)=N)NC(=O)[C@H](CC(O)=O)NC(=O)[C@H](Cc1ccc(O)cc1)NC(=O)[C@@H]1CCCN1C(=O)[C@H](CO)NC(=O)[C@H](CCCNC(N)=N)NC(=O)[C@H](C)NC(=O)[C@H](Cc1ccc(O)cc1)NC(=O)[C@H](CCCNC(N)=N)NC(=O)CNC(=O)[C@H](CO)NC(=O)[C@H](CO)NC(=O)[C@H](CCCNC(N)=N)NC(=O)[C@H](C)NC(=O)[C@@H](N)[C@@H](C)O)C(=O)N[C@@H]([C@@H](C)O)C(=O)N[C@@H](CC(O)=O)C(=O)N[C@@H](C)C(=O)N[C@@H](CO)C(=O)N[C@@H](C(C)C)C(O)=O
: