Target
5-hydroxytryptamine receptor 2B
Ligand
BDBM50026868
Substrate
Meas. Tech.
ChEMBL_2868 (CHEMBL617410)
Ki
101±n/a nM
Citation
 Blair, JBMarona-Lewicka, DKanthasamy, ALucaites, VLNelson, DLNichols, DE Thieno[3,2-b]- and thieno[2,3-b]pyrrole bioisosteric analogues of the hallucinogen and serotonin agonist N,N-dimethyltryptamine. J Med Chem 42:1106-11 (1999)  
Target
Name:
5-hydroxytryptamine receptor 2B
Synonyms:
5-HT-2B 5-hydroxytryptamine (serotonin) receptor 2B [Homo sapiens] 5-hydroxytryptamine receptor 2C (5HT2C) HTR2B Serotonin 2b (5-HT2b) receptor | Serotonin Receptor 2B
Type:
G Protein-Coupled Receptor (GPCR)
Mol. Mass.:
54312.47
Organism:
Homo sapiens (Human)
Description:
Receptor binding assays were performed using human clone stably expressed in CHO cells.
Residue:
481
  
Inhibitor
Name:
BDBM50026868
Synonyms:
2-(1H-indol-3-yl)-N,N-dimethylethanamine 3-(2-dimethylaminoethyl)indole CHEMBL12420 N,N-dimethyl-1H-indole-3-ethylamine WO2023019367, Compound DMT
Type:
Small organic molecule
Emp. Form.:
C12H16N2
Mol. Mass.:
188.2688
SMILES:
CN(C)CCc1c[nH]c2ccccc12
: