Target
5-hydroxytryptamine receptor 2C
Ligand
BDBM50074914
Substrate
Meas. Tech.
ChEMBL_2721 (CHEMBL617281)
Ki
102±n/a nM
Citation
 Blair, JBMarona-Lewicka, DKanthasamy, ALucaites, VLNelson, DLNichols, DE Thieno[3,2-b]- and thieno[2,3-b]pyrrole bioisosteric analogues of the hallucinogen and serotonin agonist N,N-dimethyltryptamine. J Med Chem 42:1106-11 (1999)  
Target
Name:
5-hydroxytryptamine receptor 2C
Synonyms:
5-HT-1C 5-HT1C 5-HT2C-INI 5-HTR2C 5-hydroxytryptamine receptor 2C (5-HT-2C) 5HT-1C HTR1C Serotonin (5-HT3) receptor Serotonin Receptor 2C
Type:
G Protein-Coupled Receptor (GPCR)
Mol. Mass.:
51836.79
Organism:
Homo sapiens (Human)
Description:
P28335
Residue:
458
  
Inhibitor
Name:
BDBM50074914
Synonyms:
CHEMBL13086 N,N-dimethyl-2-(6H-thieno[2,3-b]pyrrol-4-yl)ethanamine
Type:
Small organic molecule
Emp. Form.:
C10H14N2S
Mol. Mass.:
194.297
SMILES:
CN(C)CCc1c[nH]c2sccc12
: