Target
5-hydroxytryptamine receptor 2B
Ligand
BDBM50074914
Substrate
Meas. Tech.
ChEMBL_2867 (CHEMBL617409)
Ki
483±n/a nM
Citation
 Blair, JBMarona-Lewicka, DKanthasamy, ALucaites, VLNelson, DLNichols, DE Thieno[3,2-b]- and thieno[2,3-b]pyrrole bioisosteric analogues of the hallucinogen and serotonin agonist N,N-dimethyltryptamine. J Med Chem 42:1106-11 (1999)  
Target
Name:
5-hydroxytryptamine receptor 2B
Synonyms:
5-HT-2B 5-hydroxytryptamine (serotonin) receptor 2B [Homo sapiens] 5-hydroxytryptamine receptor 2C (5HT2C) HTR2B Serotonin 2b (5-HT2b) receptor | Serotonin Receptor 2B
Type:
G Protein-Coupled Receptor (GPCR)
Mol. Mass.:
54312.47
Organism:
Homo sapiens (Human)
Description:
Receptor binding assays were performed using human clone stably expressed in CHO cells.
Residue:
481
  
Inhibitor
Name:
BDBM50074914
Synonyms:
CHEMBL13086 N,N-dimethyl-2-(6H-thieno[2,3-b]pyrrol-4-yl)ethanamine
Type:
Small organic molecule
Emp. Form.:
C10H14N2S
Mol. Mass.:
194.297
SMILES:
CN(C)CCc1c[nH]c2sccc12
: