Target
UDP-3-O-acyl-N-acetylglucosamine deacetylase
Ligand
BDBM50074939
Substrate
Meas. Tech.
ChEMBL_212260 (CHEMBL816285)
IC50
3000±n/a nM
Citation
 Chen, MHSteiner, MGde Laszlo, SEPatchett, AAAnderson, MSHyland, SAOnishi, HRSilver, LLRaetz, CR Carbohydroxamido-oxazolidines: antibacterial agents that target lipid A biosynthesis. Bioorg Med Chem Lett 9:313-8 (1999)  
Target
Name:
UDP-3-O-acyl-N-acetylglucosamine deacetylase
Synonyms:
LPXC_ECOLI UDP-3-O-[3-hydroxymyristoyl] N-acetylglucosamine deacetylase (LxpC) asmB lpxC
Type:
Enzyme
Mol. Mass.:
33952.00
Organism:
Escherichia coli
Description:
P0A725
Residue:
305
  
Inhibitor
Name:
BDBM50074939
Synonyms:
2-Phenyl-4,5-dihydro-oxazole-4-carboxylic acid hydroxyamide L-573655
Type:
Small organic molecule
Emp. Form.:
C10H10N2O3
Mol. Mass.:
206.198
SMILES:
ONC(=O)C1COC(=N1)c1ccccc1
: