Target
Thromboxane A2 receptor
Ligand
BDBM50075077
Substrate
Meas. Tech.
ChEBML_221825
IC50
950.0±n/a nM
Citation
 Shinozaki, KSato, HIwakuma, TSato, RKurimoto, TYoshida, K Synthesis and thromboxane A2 antagonistic activity activity of indane derivatives. Bioorg Med Chem Lett 9:401-6 (1999)  
Target
Name:
Thromboxane A2 receptor
Synonyms:
Prostanoid TP receptor TBXA2R Thromboxane Thromboxane Beta
Type:
Enyzme
Mol. Mass.:
37445.28
Organism:
Homo sapiens (Human)
Description:
P21731
Residue:
343
  
Inhibitor
Name:
BDBM50075077
Synonyms:
CHEMBL131497 | Sodium; {2-[(naphthalene-2-sulfonylamino)-methyl]-indan-5-yl}-acetate
Type:
Small organic molecule
Emp. Form.:
C22H20NO4S
Mol. Mass.:
394.464
SMILES:
[O-]C(=O)Cc1ccc2CC(CNS(=O)(=O)c3ccc4ccccc4c3)Cc2c1
: