Target
Cathepsin G
Ligand
BDBM50075116
Substrate
Meas. Tech.
ChEBML_45350
IC50
190±n/a nM
Citation
 Iijima, KKatada, JHayashi, Y Symmetrical anhydride-type serine protease inhibitors: structure-activity relationship studies of human chymase inhibitors. Bioorg Med Chem Lett 9:413-8 (1999)  
Target
Name:
Cathepsin G
Synonyms:
CATG_HUMAN CTSG
Type:
PROTEIN
Mol. Mass.:
28860.08
Organism:
Homo sapiens (Human)
Description:
ChEMBL_1469016
Residue:
255
  
Inhibitor
Name:
BDBM50075116
Synonyms:
2-(4-cyanophenylcarboxamido)-1,1-dimethyl-2-(2-methylphenyl)propanoic anhydride | CHEMBL336964
Type:
Small organic molecule
Emp. Form.:
C40H38N4O5
Mol. Mass.:
654.7535
SMILES:
Cc1ccccc1C(NC(=O)c1ccc(cc1)C#N)C(C)(C)C(=O)OC(=O)C(C)(C)C(NC(=O)c1ccc(cc1)C#N)c1ccccc1C
: