Target
Tryptophan 2,3-dioxygenase
Ligand
BDBM50442988
Substrate
Meas. Tech.
ChEMBL_1882016 (CHEMBL4383515)
IC50
1490±n/a nM
Citation
 Zhang, SQi, FFang, XYang, DHu, HHuang, QKuang, CYang, Q Tryptophan 2,3-dioxygenase inhibitory activities of tryptanthrin derivatives. Eur J Med Chem 160:133-145 (2018)  
Target
Name:
Tryptophan 2,3-dioxygenase
Synonyms:
T23O_HUMAN TDO2 TRPO Tryptophan oxygenase Tryptophanase
Type:
PROTEIN
Mol. Mass.:
47874.48
Organism:
Homo sapiens (Human)
Description:
ChEMBL_825691
Residue:
406
  
Inhibitor
Name:
BDBM50442988
Synonyms:
CHEMBL3087009
Type:
Small organic molecule
Emp. Form.:
C15H6F2N2O2
Mol. Mass.:
284.2171
SMILES:
Fc1ccc-2c(c1)C(=O)c1nc3ccc(F)cc3c(=O)n-21
: