Target
Tryptophan 2,3-dioxygenase
Ligand
BDBM50442995
Substrate
Meas. Tech.
ChEMBL_1882018 (CHEMBL4383517)
Ki
876±n/a nM
Citation
 Zhang, SQi, FFang, XYang, DHu, HHuang, QKuang, CYang, Q Tryptophan 2,3-dioxygenase inhibitory activities of tryptanthrin derivatives. Eur J Med Chem 160:133-145 (2018)  
Target
Name:
Tryptophan 2,3-dioxygenase
Synonyms:
T23O_HUMAN TDO2 TRPO Tryptophan oxygenase Tryptophanase
Type:
PROTEIN
Mol. Mass.:
47874.48
Organism:
Homo sapiens (Human)
Description:
ChEMBL_825691
Residue:
406
  
Inhibitor
Name:
BDBM50442995
Synonyms:
CHEMBL3086870
Type:
Small organic molecule
Emp. Form.:
C15H7FN2O2
Mol. Mass.:
266.2267
SMILES:
Fc1ccc2nc3C(=O)c4ccccc4-n3c(=O)c2c1
: