Target
Tryptophan 2,3-dioxygenase
Ligand
BDBM50442994
Substrate
Meas. Tech.
ChEMBL_1882019 (CHEMBL4383518)
IC50
184±n/a nM
Citation
 Zhang, SQi, FFang, XYang, DHu, HHuang, QKuang, CYang, Q Tryptophan 2,3-dioxygenase inhibitory activities of tryptanthrin derivatives. Eur J Med Chem 160:133-145 (2018)  
Target
Name:
Tryptophan 2,3-dioxygenase
Synonyms:
T23O_HUMAN TDO2 TRPO Tryptophan oxygenase Tryptophanase
Type:
PROTEIN
Mol. Mass.:
47874.48
Organism:
Homo sapiens (Human)
Description:
ChEMBL_825691
Residue:
406
  
Inhibitor
Name:
BDBM50442994
Synonyms:
CHEMBL312537 | US10669273, Compound 5b
Type:
Small organic molecule
Emp. Form.:
C16H10N2O2
Mol. Mass.:
262.2628
SMILES:
Cc1ccc-2c(c1)C(=O)c1nc3ccccc3c(=O)n-21
: