Target
Tryptophan 2,3-dioxygenase
Ligand
BDBM48009
Substrate
Meas. Tech.
ChEMBL_1882019 (CHEMBL4383518)
IC50
60±n/a nM
Citation
 Zhang, SQi, FFang, XYang, DHu, HHuang, QKuang, CYang, Q Tryptophan 2,3-dioxygenase inhibitory activities of tryptanthrin derivatives. Eur J Med Chem 160:133-145 (2018)  
Target
Name:
Tryptophan 2,3-dioxygenase
Synonyms:
T23O_HUMAN TDO2 TRPO Tryptophan oxygenase Tryptophanase
Type:
PROTEIN
Mol. Mass.:
47874.48
Organism:
Homo sapiens (Human)
Description:
ChEMBL_825691
Residue:
406
  
Inhibitor
Name:
BDBM48009
Synonyms:
8-fluoranylindolo[2,1-b]quinazoline-6,12-dione 8-fluoroindolo[2,1-b]quinazoline-6,12-quinone SMR000544298 cid_478574
Type:
Small organic molecule
Emp. Form.:
C15H7FN2O2
Mol. Mass.:
266.2267
SMILES:
Fc1ccc-2c(c1)C(=O)c1nc3ccccc3c(=O)n-21
: