Target
Tryptophan 2,3-dioxygenase
Ligand
BDBM50126143
Substrate
Meas. Tech.
ChEMBL_1882019 (CHEMBL4383518)
IC50
260±n/a nM
Citation
 Zhang, SQi, FFang, XYang, DHu, HHuang, QKuang, CYang, Q Tryptophan 2,3-dioxygenase inhibitory activities of tryptanthrin derivatives. Eur J Med Chem 160:133-145 (2018)  
Target
Name:
Tryptophan 2,3-dioxygenase
Synonyms:
T23O_HUMAN TDO2 TRPO Tryptophan oxygenase Tryptophanase
Type:
PROTEIN
Mol. Mass.:
47874.48
Organism:
Homo sapiens (Human)
Description:
ChEMBL_825691
Residue:
406
  
Inhibitor
Name:
BDBM50126143
Synonyms:
Epacadostat | INCB-024360
Type:
Small organic molecule
Emp. Form.:
C11H13BrFN7O4S
Mol. Mass.:
438.233
SMILES:
NS(=O)(=O)NCCNc1nonc1\C(Nc1ccc(F)c(Br)c1)=N\O
: