Target
Tryptophan 2,3-dioxygenase
Ligand
BDBM50442987
Substrate
Meas. Tech.
ChEMBL_1882020 (CHEMBL4383519)
IC50
53±n/a nM
Citation
 Zhang, SQi, FFang, XYang, DHu, HHuang, QKuang, CYang, Q Tryptophan 2,3-dioxygenase inhibitory activities of tryptanthrin derivatives. Eur J Med Chem 160:133-145 (2018)  
Target
Name:
Tryptophan 2,3-dioxygenase
Synonyms:
T23O_HUMAN TDO2 TRPO Tryptophan oxygenase Tryptophanase
Type:
PROTEIN
Mol. Mass.:
47874.48
Organism:
Homo sapiens (Human)
Description:
ChEMBL_825691
Residue:
406
  
Inhibitor
Name:
BDBM50442987
Synonyms:
8-Bromotryptanthrin | CHEMBL72165
Type:
Small organic molecule
Emp. Form.:
C15H7BrN2O2
Mol. Mass.:
327.132
SMILES:
Brc1ccc-2c(c1)C(=O)c1nc3ccccc3c(=O)n-21
: