Target
Tryptophan 2,3-dioxygenase
Ligand
BDBM50442990
Substrate
Meas. Tech.
ChEMBL_1882020 (CHEMBL4383519)
IC50
733±n/a nM
Citation
 Zhang, SQi, FFang, XYang, DHu, HHuang, QKuang, CYang, Q Tryptophan 2,3-dioxygenase inhibitory activities of tryptanthrin derivatives. Eur J Med Chem 160:133-145 (2018)  
Target
Name:
Tryptophan 2,3-dioxygenase
Synonyms:
T23O_HUMAN TDO2 TRPO Tryptophan oxygenase Tryptophanase
Type:
PROTEIN
Mol. Mass.:
47874.48
Organism:
Homo sapiens (Human)
Description:
ChEMBL_825691
Residue:
406
  
Inhibitor
Name:
BDBM50442990
Synonyms:
CHEMBL1276265
Type:
Small organic molecule
Emp. Form.:
C15H7ClN2O2
Mol. Mass.:
282.681
SMILES:
Clc1ccc2C(=O)c3nc4ccccc4c(=O)n3-c2c1
: