Target
Tryptophan 2,3-dioxygenase
Ligand
BDBM50350248
Substrate
Meas. Tech.
ChEMBL_1882016 (CHEMBL4383515)
IC50
18700±n/a nM
Citation
 Zhang, SQi, FFang, XYang, DHu, HHuang, QKuang, CYang, Q Tryptophan 2,3-dioxygenase inhibitory activities of tryptanthrin derivatives. Eur J Med Chem 160:133-145 (2018)  
Target
Name:
Tryptophan 2,3-dioxygenase
Synonyms:
T23O_HUMAN TDO2 TRPO Tryptophan oxygenase Tryptophanase
Type:
PROTEIN
Mol. Mass.:
47874.48
Organism:
Homo sapiens (Human)
Description:
ChEMBL_825691
Residue:
406
  
Inhibitor
Name:
BDBM50350248
Synonyms:
CHEMBL1812545
Type:
Small organic molecule
Emp. Form.:
C11H8FN5
Mol. Mass.:
229.2131
SMILES:
Fc1ccc2c(C=Cc3nnn[nH]3)c[nH]c2c1
: