Target
Indoleamine 2,3-dioxygenase 1
Ligand
BDBM50241727
Substrate
Meas. Tech.
ChEMBL_1882021 (CHEMBL4383520)
IC50
380000±n/a nM
Citation
 Zhang, SQi, FFang, XYang, DHu, HHuang, QKuang, CYang, Q Tryptophan 2,3-dioxygenase inhibitory activities of tryptanthrin derivatives. Eur J Med Chem 160:133-145 (2018)  
Target
Name:
Indoleamine 2,3-dioxygenase 1
Synonyms:
I23O1_HUMAN IDO-1 INDO Indoleamine 2,3-dioxygenase | Indoleamine-pyrrole 2,3-dioxygenase
Type:
Enzyme
Mol. Mass.:
45330.80
Organism:
Homo sapiens (Human)
Description:
P14902
Residue:
403
  
Inhibitor
Name:
BDBM50241727
Synonyms:
(S)-2-amino-3-(1-methyl-1H-indol-3-yl)propanoic acid 1-methyltryptophan L-1-methyl-tryptophan
Type:
Small organic molecule
Emp. Form.:
C12H14N2O2
Mol. Mass.:
218.2518
SMILES:
Cn1cc(C[C@H](N)C(O)=O)c2ccccc12
: