Target
Tryptophan 2,3-dioxygenase
Ligand
BDBM50240612
Substrate
Meas. Tech.
ChEMBL_1882020 (CHEMBL4383519)
IC50
140±n/a nM
Citation
 Zhang, SQi, FFang, XYang, DHu, HHuang, QKuang, CYang, Q Tryptophan 2,3-dioxygenase inhibitory activities of tryptanthrin derivatives. Eur J Med Chem 160:133-145 (2018)  
Target
Name:
Tryptophan 2,3-dioxygenase
Synonyms:
T23O_HUMAN TDO2 TRPO Tryptophan oxygenase Tryptophanase
Type:
PROTEIN
Mol. Mass.:
47874.48
Organism:
Homo sapiens (Human)
Description:
ChEMBL_825691
Residue:
406
  
Inhibitor
Name:
BDBM50240612
Synonyms:
CHEMBL306946 Indolo[2,1-b]quinazoline-6,12-dione TRYPTANTHRIN | US10669273, Compound 5a
Type:
Small organic molecule
Emp. Form.:
C15H8N2O2
Mol. Mass.:
248.2362
SMILES:
O=C1c2ccccc2-n2c1nc1ccccc1c2=O
: