Target
Epidermal growth factor receptor
Ligand
BDBM50521040
Substrate
Meas. Tech.
ChEMBL_1882927 (CHEMBL4384426)
IC50
15±n/a nM
Citation
 Castelli, RBozza, NCavazzoni, ABonelli, MVacondio, FFerlenghi, FCallegari, DSilva, CRivara, SLodola, ADigiacomo, GFumarola, CAlfieri, RPetronini, PGMor, M Balancing reactivity and antitumor activity: heteroarylthioacetamide derivatives as potent and time-dependent inhibitors of EGFR. Eur J Med Chem 162:507-524 (2019)  
Target
Name:
Epidermal growth factor receptor
Synonyms:
EGF Receptor Substrate EGFR_HUMAN ERBB1 Epidermal Growth Factor Receptor erbB-1 Epidermal growth factor receptor (EGFR) HER1 Proto-oncogene c-ErbB-1 Tyrosine-Protein Kinase ErbB-1
Type:
Receptor Kinase Domain
Mol. Mass.:
134279.59
Organism:
Homo sapiens (Human)
Description:
P00533
Residue:
1210
  
Inhibitor
Name:
BDBM50521040
Synonyms:
CHEMBL4435699
Type:
Small organic molecule
Emp. Form.:
C19H15ClFN3O3
Mol. Mass.:
387.792
SMILES:
CCOc1cc2ncnc(Nc3ccc(F)c(Cl)c3)c2cc1OC(=O)C=C
: