Target
Epidermal growth factor receptor
Ligand
BDBM50521048
Substrate
Meas. Tech.
ChEMBL_1882933 (CHEMBL4384432)
IC50
0.870000±n/a nM
Citation
 Castelli, RBozza, NCavazzoni, ABonelli, MVacondio, FFerlenghi, FCallegari, DSilva, CRivara, SLodola, ADigiacomo, GFumarola, CAlfieri, RPetronini, PGMor, M Balancing reactivity and antitumor activity: heteroarylthioacetamide derivatives as potent and time-dependent inhibitors of EGFR. Eur J Med Chem 162:507-524 (2019)  
Target
Name:
Epidermal growth factor receptor
Synonyms:
EGF Receptor Substrate EGFR_HUMAN ERBB1 Epidermal Growth Factor Receptor erbB-1 Epidermal growth factor receptor (EGFR) HER1 Proto-oncogene c-ErbB-1 Tyrosine-Protein Kinase ErbB-1
Type:
Receptor Kinase Domain
Mol. Mass.:
134279.59
Organism:
Homo sapiens (Human)
Description:
P00533
Residue:
1210
  
Inhibitor
Name:
BDBM50521048
Synonyms:
CHEMBL4440618
Type:
Small organic molecule
Emp. Form.:
C18H14Cl2FN3O3
Mol. Mass.:
410.226
SMILES:
CCOc1cc2ncnc(Nc3ccc(F)c(Cl)c3)c2cc1OC(=O)CCl
: