Target
Beta-1 adrenergic receptor
Ligand
BDBM50075888
Substrate
Meas. Tech.
ChEBML_37263
IC50
>10000±n/a nM
Citation
 Parmee, ERNaylor, EMPerkins, LColandrea, VJOk, HOCandelore, MRCascieri, MADeng, LFeeney, WPForrest, MJHom, GJMacIntyre, DEMiller, RRStearns, RAStrader, CDTota, LWyvratt, MJFisher, MHWeber, AE Human beta3 adrenergic receptor agonists containing cyclic ureidobenzenesulfonamides. Bioorg Med Chem Lett 9:749-54 (1999)  
Target
Name:
Beta-1 adrenergic receptor
Synonyms:
ADRB1 ADRB1_HUMAN Beta-1 adrenoceptor adrenergic Beta1
Type:
G Protein-Coupled Receptor (GPCR)
Mol. Mass.:
51338.40
Organism:
Homo sapiens (Human)
Description:
P08588
Residue:
477
  
Inhibitor
Name:
BDBM50075888
Synonyms:
4-(1-Hexyl-5-oxo-1,5-dihydro-[1,2,4]triazol-4-yl)-N-{4-[2-((R)-2-hydroxy-2-pyridin-3-yl-ethylamino)-ethyl]-phenyl}-benzenesulfonamide CHEMBL314893
Type:
Small organic molecule
Emp. Form.:
C29H36N6O4S
Mol. Mass.:
564.699
SMILES:
CCCCCCn1ncn(-c2ccc(cc2)S(=O)(=O)Nc2ccc(CCNC[C@H](O)c3cccnc3)cc2)c1=O
: