Target
Beta-3 adrenergic receptor
Ligand
BDBM50075888
Substrate
Meas. Tech.
ChEBML_38784
EC50
100±n/a nM
Citation
 Parmee, ERNaylor, EMPerkins, LColandrea, VJOk, HOCandelore, MRCascieri, MADeng, LFeeney, WPForrest, MJHom, GJMacIntyre, DEMiller, RRStearns, RAStrader, CDTota, LWyvratt, MJFisher, MHWeber, AE Human beta3 adrenergic receptor agonists containing cyclic ureidobenzenesulfonamides. Bioorg Med Chem Lett 9:749-54 (1999)  
Target
Name:
Beta-3 adrenergic receptor
Synonyms:
ADRB3 ADRB3_HUMAN Beta-2 adrenergic receptor and beta-3 adrenergic receptor Beta-3 adrenoreceptor | adrenergic Beta3
Type:
G Protein-Coupled Receptor (GPCR)
Mol. Mass.:
43534.88
Organism:
Homo sapiens (Human)
Description:
Residue:
408
  
Inhibitor
Name:
BDBM50075888
Synonyms:
4-(1-Hexyl-5-oxo-1,5-dihydro-[1,2,4]triazol-4-yl)-N-{4-[2-((R)-2-hydroxy-2-pyridin-3-yl-ethylamino)-ethyl]-phenyl}-benzenesulfonamide CHEMBL314893
Type:
Small organic molecule
Emp. Form.:
C29H36N6O4S
Mol. Mass.:
564.699
SMILES:
CCCCCCn1ncn(-c2ccc(cc2)S(=O)(=O)Nc2ccc(CCNC[C@H](O)c3cccnc3)cc2)c1=O
: