Target
Tyrosine-protein kinase BTK
Ligand
BDBM50357312
Substrate
Meas. Tech.
ChEMBL_1883984 (CHEMBL4385483)
IC50
3.4±n/a nM
Citation
 Schnute, MEBenoit, SEBuchler, IPCaspers, NGrapperhaus, MLHan, SHotchandani, RHuang, NHughes, ROJuba, BMKim, KHLiu, EMcCarthy, EMessing, DMiyashiro, JSMohan, SO'Connell, TNOhren, JFParikh, MDSchmidt, MSelness, SRSpringer, JRThanabal, VTrujillo, JIWalker, DPWan, ZKWithka, JMWittwer, AJWood, NLXing, LZapf, CWDouhan, J Aminopyrazole Carboxamide Bruton's Tyrosine Kinase Inhibitors. Irreversible to Reversible Covalent Reactive Group Tuning. ACS Med Chem Lett 10:80-85 (2019)  
Target
Name:
Tyrosine-protein kinase BTK
Synonyms:
AGMX1 Agammaglobulinaemia tyrosine kinase B cell progenitor kinase BPK BTK_HUMAN Tyrosine Kinase BTK Tyrosine-protein kinase BTK (BTK)
Type:
Enzyme
Mol. Mass.:
76289.95
Organism:
Homo sapiens (Human)
Description:
Q06187
Residue:
659
  
Inhibitor
Name:
BDBM50357312
Synonyms:
IBRUTINIB US10124003, Ref. Ex. Compound 1 US10793575, Example ibrutinib US10919899, Ibrutinib US11186578, Example Ibrutinib US11407754, Example Ibrutinib US20240059694, Compound Ibrutinib US9181263, 1 | US9278100, 1
Type:
Small organic molecule
Emp. Form.:
C25H24N6O2
Mol. Mass.:
440.4971
SMILES:
Nc1ncnc2n(nc(-c3ccc(Oc4ccccc4)cc3)c12)[C@@H]1CCCN(C1)C(=O)C=C
: