Target
Tyrosine-protein kinase BTK
Ligand
BDBM377824
Substrate
Meas. Tech.
ChEMBL_1883985 (CHEMBL4385484)
IC50
7.6±n/a nM
Citation
 Schnute, MEBenoit, SEBuchler, IPCaspers, NGrapperhaus, MLHan, SHotchandani, RHuang, NHughes, ROJuba, BMKim, KHLiu, EMcCarthy, EMessing, DMiyashiro, JSMohan, SO'Connell, TNOhren, JFParikh, MDSchmidt, MSelness, SRSpringer, JRThanabal, VTrujillo, JIWalker, DPWan, ZKWithka, JMWittwer, AJWood, NLXing, LZapf, CWDouhan, J Aminopyrazole Carboxamide Bruton's Tyrosine Kinase Inhibitors. Irreversible to Reversible Covalent Reactive Group Tuning. ACS Med Chem Lett 10:80-85 (2019)  
Target
Name:
Tyrosine-protein kinase BTK
Synonyms:
AGMX1 Agammaglobulinaemia tyrosine kinase B cell progenitor kinase BPK BTK_HUMAN Tyrosine Kinase BTK Tyrosine-protein kinase BTK (BTK)
Type:
Enzyme
Mol. Mass.:
76289.95
Organism:
Homo sapiens (Human)
Description:
Q06187
Residue:
659
  
Inhibitor
Name:
BDBM377824
Synonyms:
(R)-5-amino-3-(4-((5-chloro-3-fluoropyridin-2-yl)oxy)phenyl)-1-(1-cyanopiperidin-3-yl)-1H-pyrazole-4-carboxamide US10815213, Example 118
Type:
Small organic molecule
Emp. Form.:
C21H19ClFN7O2
Mol. Mass.:
455.873
SMILES:
NC(=O)c1c(N)n(nc1-c1ccc(Oc2ncc(Cl)cc2F)cc1)[C@@H]1CCCN(C1)C#N
: