Target
Geranylgeranyl transferase type-1 subunit beta/Protein farnesyltransferase/geranylgeranyltransferase type-1 subunit alpha
Ligand
BDBM50076127
Substrate
Meas. Tech.
ChEMBL_161709 (CHEMBL770239)
IC50
32±n/a nM
Citation
 Vasudevan, AQian, YVogt, ABlaskovich, MAOhkanda, JSebti, SMHamilton, AD Potent, highly selective, and non-thiol inhibitors of protein geranylgeranyltransferase-I. J Med Chem 42:1333-40 (1999)  
Target
Name:
Geranylgeranyl transferase type-1 subunit beta/Protein farnesyltransferase/geranylgeranyltransferase type-1 subunit alpha
Synonyms:
Geranylgeranyl transferase type I Geranylgeranyl transferase type I beta/Protein farnesyltransferase/geranylgeranyltransferase type I alpha subunit
Type:
Mol. Mass.:
Description:
ASSAY_ID of EBI is 70196
Components:
This complex has 2 components.
Component 1
Name:
Protein farnesyltransferase/geranylgeranyltransferase type-1 subunit alpha
Synonyms:
CAAX farnesyltransferase alpha subunit FNTA_HUMAN FTase-alpha Geranylgeranyl Transferase (GGTase-I) Chain A Protein Farnesyltransferase (PFT) Chain A Protein farnesyltransferase Protein farnesyltransferase/geranylgeranyltransferase type I alpha subunit | Ras proteins prenyltransferase alpha
Type:
Enzyme
Mol. Mass.:
44392.46
Organism:
Homo sapiens (Human)
Description:
Recombinant human FTase.
Residue:
379
  
Component 2
Name:
Geranylgeranyl transferase type-1 subunit beta
Synonyms:
2.5.1.59 Geranylgeranyl transferase type I Geranylgeranyl transferase type I subunit beta PGGT1B Protein farnesyl/geranylgeranyl transferase | Type I protein geranyl-geranyltransferase subunit beta
Type:
Mol. Mass.:
42369.84
Organism:
Homo sapiens (Human)
Description:
Residue:
377
  
Inhibitor
Name:
BDBM50076127
Synonyms:
(S)-2-{[5-(2-Imidazol-1-yl-ethoxy)-biphenyl-2-carbonyl]-amino}-4-methyl-pentanoic acid | CHEMBL26923
Type:
Small organic molecule
Emp. Form.:
C24H27N3O4
Mol. Mass.:
421.4889
SMILES:
CC(C)C[C@H](NC(=O)c1ccc(OCCn2ccnc2)cc1-c1ccccc1)C(O)=O
: