Target
Matrix metalloproteinase-9
Ligand
BDBM50064797
Substrate
Meas. Tech.
ChEMBL_105219 (CHEMBL715559)
IC50
79±n/a nM
Citation
 Szardenings, AKAntonenko, VCampbell, DADeFrancisco, NIda, SShi, LSharkov, NTien, DWang, YNavre, M Identification of highly selective inhibitors of collagenase-1 from combinatorial libraries of diketopiperazines. J Med Chem 42:1348-57 (1999)  
Target
Name:
Matrix metalloproteinase-9
Synonyms:
67 kDa matrix metalloproteinase-9 92 kDa gelatinase CLG4B Gelatinase B MMP9 Matrix metalloproteinase 9 (MMP-9) Matrix metalloproteinase-9 (MMP9)
Type:
Enzyme
Mol. Mass.:
78452.28
Organism:
Homo sapiens (Human)
Description:
P14780
Residue:
707
  
Inhibitor
Name:
BDBM50064797
Synonyms:
(3R,6S)-6-Cyclohexylmethyl-3-mercaptomethyl-1-(4-methoxy-benzyl)-piperazine-2,5-dione | CHEMBL29897
Type:
Small organic molecule
Emp. Form.:
C20H28N2O3S
Mol. Mass.:
376.513
SMILES:
COc1ccc(CN2[C@@H](CC3CCCCC3)C(=O)N[C@@H](CS)C2=O)cc1
: