Target
Interstitial collagenase
Ligand
BDBM50076162
Substrate
Meas. Tech.
ChEMBL_106114 (CHEMBL713707)
IC50
37±n/a nM
Citation
 Szardenings, AKAntonenko, VCampbell, DADeFrancisco, NIda, SShi, LSharkov, NTien, DWang, YNavre, M Identification of highly selective inhibitors of collagenase-1 from combinatorial libraries of diketopiperazines. J Med Chem 42:1348-57 (1999)  
Target
Name:
Interstitial collagenase
Synonyms:
CLG MMP1 Matrix metalloproteinase-1 | Matrix metalloproteinase-1 (MMP-1)
Type:
Enzyme
Mol. Mass.:
54010.26
Organism:
Homo sapiens (Human)
Description:
P03956
Residue:
469
  
Inhibitor
Name:
BDBM50076162
Synonyms:
2-((2S,5R)-2-(4-nitrobenzyl)-5-(mercaptomethyl)-3,6-dioxopiperazin-1-yl)-N-tert-butyl-2-cyclopropylacetamide N-tert-Butyl-2-cyclopropyl-2-[(3R,6S)-3-mercaptomethyl-6-(4-nitro-benzyl)-2,5-dioxo-piperazin-1-yl]-acetamide
Type:
Small organic molecule
Emp. Form.:
C21H28N4O5S
Mol. Mass.:
448.536
SMILES:
CC(C)(C)NC(=O)C(C1CC1)N1[C@@H](Cc2ccc(cc2)[N+]([O-])=O)C(=O)N[C@@H](CS)C1=O
: