Target
Interstitial collagenase
Ligand
BDBM50076156
Substrate
Meas. Tech.
ChEMBL_106114 (CHEMBL713707)
IC50
310±n/a nM
Citation
 Szardenings, AKAntonenko, VCampbell, DADeFrancisco, NIda, SShi, LSharkov, NTien, DWang, YNavre, M Identification of highly selective inhibitors of collagenase-1 from combinatorial libraries of diketopiperazines. J Med Chem 42:1348-57 (1999)  
Target
Name:
Interstitial collagenase
Synonyms:
CLG MMP1 Matrix metalloproteinase-1 | Matrix metalloproteinase-1 (MMP-1)
Type:
Enzyme
Mol. Mass.:
54010.26
Organism:
Homo sapiens (Human)
Description:
P03956
Residue:
469
  
Inhibitor
Name:
BDBM50076156
Synonyms:
(3R,6R)-3-Mercaptomethyl-1-(4-methoxy-benzyl)-6-(4-methoxy-benzylsulfanylmethyl)-piperazine-2,5-dione | CHEMBL424407
Type:
Small organic molecule
Emp. Form.:
C22H26N2O4S2
Mol. Mass.:
446.583
SMILES:
COc1ccc(CSC[C@@H]2N(Cc3ccc(OC)cc3)C(=O)[C@H](CS)NC2=O)cc1
: