Target
Metabotropic glutamate receptor 2
Ligand
BDBM50076390
Substrate
Meas. Tech.
ChEMBL_106208 (CHEMBL713197)
IC50
102000±n/a nM
Citation
 Jullian, NBrabet, IPin, JPAcher, FC Agonist selectivity of mGluR1 and mGluR2 metabotropic receptors: a different environment but similar recognition of an extended glutamate conformation. J Med Chem 42:1546-55 (1999)  
Target
Name:
Metabotropic glutamate receptor 2
Synonyms:
GPRC1B GRM2_HUMAN Metabotropic glutamate receptor mGlu2 | metabotropic glutamate 2
Type:
Enzyme
Mol. Mass.:
95584.88
Organism:
Homo sapiens (Human)
Description:
Q14416
Residue:
872
  
Inhibitor
Name:
BDBM50076390
Synonyms:
(S)-2-Amino-4-carboxy-pentanedioic acid GAMMA-CARBOXY-GLUTAMIC ACID
Type:
Small organic molecule
Emp. Form.:
C6H9NO6
Mol. Mass.:
191.1388
SMILES:
N[C@@H](CC(C(O)=O)C(O)=O)C(O)=O
: