Target
Muscarinic acetylcholine receptor M4
Ligand
BDBM50521767
Substrate
Meas. Tech.
ChEMBL_1885222 (CHEMBL4386804)
EC50
130±n/a nM
Citation
 Chopko, TCHan, CGregro, AREngers, DWFelts, ASPoslusney, MSBollinger, KAMorrison, RDBubser, MLamsal, ALuscombe, VBCho, HPSchnetz-Boutaud, NCRodriguez, ALChang, SDaniels, JSStec, DFNiswender, CMJones, CKWood, MRWood, MWDuggan, MEBrandon, NJConn, PJBridges, TMLindsley, CWMelancon, BJ SAR inspired by aldehyde oxidase (AO) metabolism: Discovery of novel, CNS penetrant tricyclic M Bioorg Med Chem Lett 29:2224-2228 (2019)  
Target
Name:
Muscarinic acetylcholine receptor M4
Synonyms:
ACM4_HUMAN Cholinergic, muscarinic M4 Muscarinic acetylcholine receptor M2 and M4
Type:
Enzyme Catalytic Domain
Mol. Mass.:
53079.31
Organism:
Homo sapiens (Human)
Description:
Cholinergic, muscarinic M4 CHRM4 HUMAN M3::P08173
Residue:
479
  
Inhibitor
Name:
BDBM50521767
Synonyms:
CHEMBL4574990
Type:
Small organic molecule
Emp. Form.:
C14H14N4OS
Mol. Mass.:
286.352
SMILES:
Cc1cc2nccn2c2sc(C(=O)NC3CC3)c(N)c12
: