Target
Muscarinic acetylcholine receptor M2
Ligand
BDBM50521758
Substrate
Meas. Tech.
ChEMBL_1885235 (CHEMBL4386817)
EC50
1200±n/a nM
Citation
 Chopko, TCHan, CGregro, AREngers, DWFelts, ASPoslusney, MSBollinger, KAMorrison, RDBubser, MLamsal, ALuscombe, VBCho, HPSchnetz-Boutaud, NCRodriguez, ALChang, SDaniels, JSStec, DFNiswender, CMJones, CKWood, MRWood, MWDuggan, MEBrandon, NJConn, PJBridges, TMLindsley, CWMelancon, BJ SAR inspired by aldehyde oxidase (AO) metabolism: Discovery of novel, CNS penetrant tricyclic M Bioorg Med Chem Lett 29:2224-2228 (2019)  
Target
Name:
Muscarinic acetylcholine receptor M2
Synonyms:
ACM2_HUMAN Cholinergic, muscarinic M2 Muscarinic acetylcholine receptor M2 and M5 | RecName: Full=Muscarinic acetylcholine receptor M2
Type:
GPCR
Mol. Mass.:
51730.61
Organism:
Homo sapiens (Human)
Description:
P08172
Residue:
466
  
Inhibitor
Name:
BDBM50521758
Synonyms:
CHEMBL4549515
Type:
Small organic molecule
Emp. Form.:
C20H18F2N6OS
Mol. Mass.:
428.458
SMILES:
Cc1nc2cc(C)c3c(N)c(sc3n2n1)C(=O)NC1CN(C1)c1ccc(F)c(F)c1
: