Target
Tyrosinase
Ligand
BDBM50521808
Substrate
Meas. Tech.
ChEMBL_1885371 (CHEMBL4386953)
IC50
30090±n/a nM
Citation
 Santi, MDPeralta, MAPuiatti, MCabrera, JLOrtega, MG Melanogenic inhibitory effects of Triangularin in B16F0 melanoma cells, in vitro and molecular docking studies. Bioorg Med Chem 27:3722-3728 (2019)  
Target
Name:
Tyrosinase
Synonyms:
TYRO_MOUSE | Tyr
Type:
Protein
Mol. Mass.:
60600.74
Organism:
Mus musculus (Mouse)
Description:
Residue:
533
  
Inhibitor
Name:
BDBM50521808
Synonyms:
CHEMBL4462424
Type:
Small organic molecule
Emp. Form.:
C17H16O4
Mol. Mass.:
284.3065
SMILES:
COc1cc(O)c(C(=O)\C=C\c2ccccc2)c(O)c1C
: