Target
Tyrosinase
Ligand
BDBM50031467
Substrate
Meas. Tech.
ChEMBL_1885371 (CHEMBL4386953)
IC50
89700±n/a nM
Citation
 Santi, MDPeralta, MAPuiatti, MCabrera, JLOrtega, MG Melanogenic inhibitory effects of Triangularin in B16F0 melanoma cells, in vitro and molecular docking studies. Bioorg Med Chem 27:3722-3728 (2019)  
Target
Name:
Tyrosinase
Synonyms:
TYRO_MOUSE | Tyr
Type:
Protein
Mol. Mass.:
60600.74
Organism:
Mus musculus (Mouse)
Description:
Residue:
533
  
Inhibitor
Name:
BDBM50031467
Synonyms:
5-HYDROXY-2-(HYDROXYMETHYL)-4H-PYRAN-4-ONE CHEMBL287556 US10857082, Kojic acid US9682910, kojic acid
Type:
Small organic molecule
Emp. Form.:
C6H6O4
Mol. Mass.:
142.1094
SMILES:
OCc1cc(=O)c(O)co1
: