Target
Cyclin-dependent kinase 6/G1/S-specific cyclin-D3
Ligand
BDBM50521935
Substrate
Meas. Tech.
ChEMBL_1885552 (CHEMBL4387134)
Ki
1.7±n/a nM
Citation
Target
Name:
Cyclin-dependent kinase 6/G1/S-specific cyclin-D3
Synonyms:
CDK6/CycD3 CDK6/G1/S-specific cyclin D3 Cyclin-dependent kinase 6 | Cyclin-dependent kinase 6/G1/S-specific cyclin D3
Type:
Protein
Mol. Mass.:
Description:
Components:
This complex has 2 components.
Component 1
Name:
Cyclin-dependent kinase 6
Synonyms:
CDK6 CDKN6 Cyclin-dependent kinase 6 (CDK 6) | Serine/threonine-protein kinase PLSTIRE
Type:
Enzyme Subunit
Mol. Mass.:
36937.42
Organism:
Homo sapiens (Human)
Description:
Q00534
Residue:
326
  
Component 2
Name:
G1/S-specific cyclin-D3
Synonyms:
CCND3 | CCND3_HUMAN
Type:
Enzyme
Mol. Mass.:
32521.90
Organism:
Homo sapiens (Human)
Description:
P30281
Residue:
292
  
Inhibitor
Name:
BDBM50521935
Synonyms:
CHEMBL4589135
Type:
Small organic molecule
Emp. Form.:
C24H29FN8
Mol. Mass.:
448.5391
SMILES:
C[C@@H]1CCCCn2ncc(c12)-c1nc(Nc2ccc(cn2)N2CC3(CN(C)C3)C2)ncc1F
: