Target
Kallikrein-8
Ligand
BDBM50522493
Substrate
Meas. Tech.
ChEMBL_1886797 (CHEMBL4388474)
IC50
794±n/a nM
Citation
 Walker, ALBingham, RPEdgar, EVFerrie, AHolmes, DSLiddle, JPolyakova, ORella, MSmith, KJThorpe, JHWang, YWhite, GVYoung, RJHovnanian, A Structure guided drug design to develop kallikrein 5 inhibitors to treat Netherton syndrome. Bioorg Med Chem Lett 29:1454-1458 (2019)  
Target
Name:
Kallikrein-8
Synonyms:
KLK8 Kallikrein 8 NP Neuropsin PRSS19 Serine protease TADG-14 Tumor-associated differentially expressed gene 14 protein | hK8
Type:
PROTEIN
Mol. Mass.:
28053.09
Organism:
Homo sapiens (Human)
Description:
ChEMBL_600069
Residue:
260
  
Inhibitor
Name:
BDBM50522493
Synonyms:
CHEMBL4530083
Type:
Small organic molecule
Emp. Form.:
C23H22N6O
Mol. Mass.:
398.4604
SMILES:
NC(=N)c1ccc(NCc2nc(c[nH]2)-c2ccccc2)cc1OCc1cccnc1
: