Target
Metabotropic glutamate receptor 2
Ligand
BDBM50078224
Substrate
Meas. Tech.
ChEMBL_106214 (CHEMBL713202)
Ki
>10000±n/a nM
Citation
 Wichmann, JAdam, GKolczewski, SMutel, VWoltering, T Structure-activity relationships of substituted 5H-thiazolo[3,2-a]pyrimidines as group 2 metabotropic glutamate receptor antagonists. Bioorg Med Chem Lett 9:1573-6 (1999)  
Target
Name:
Metabotropic glutamate receptor 2
Synonyms:
GRM2_RAT Grm2 | Mglur2
Type:
PROTEIN
Mol. Mass.:
95786.41
Organism:
Rattus norvegicus
Description:
ChEMBL_105034
Residue:
872
  
Inhibitor
Name:
BDBM50078224
Synonyms:
7-Benzoyl-2-(2,6-dichloro-phenyl)-5-(2-methoxy-phenyl)-5H-thiazolo[3,2-a]pyrimidine-6-carboxylic acid 2-dimethylamino-ethyl ester | CHEMBL41630
Type:
Small organic molecule
Emp. Form.:
C31H27Cl2N3O4S
Mol. Mass.:
608.535
SMILES:
COc1ccccc1C1N2C=C(SC2=NC(C(=O)c2ccccc2)=C1C(=O)OCCN(C)C)c1c(Cl)cccc1Cl
: