Target
Uracil-DNA glycosylase
Ligand
BDBM50078336
Substrate
Meas. Tech.
ChEMBL_212798 (CHEMBL878031)
IC50
20000±n/a nM
Citation
 Sun, HZhi, CWright, GEUbiali, DPregnolato, MVerri, AFocher, FSpadari, S Molecular modeling and synthesis of inhibitors of herpes simplex virus type 1 uracil-DNA glycosylase. J Med Chem 42:2344-50 (1999)  
Target
Name:
Uracil-DNA glycosylase
Synonyms:
DGU UNG UNG15 Uracil-DNA glycosylase (UNG)
Type:
Protein
Mol. Mass.:
34661.15
Organism:
Homo sapiens (Human)
Description:
P1305
Residue:
313
  
Inhibitor
Name:
BDBM50078336
Synonyms:
6-(4-Hexyl-phenylamino)-1-(2-hydroxy-ethyl)-1H-pyrimidine-2,4-dione | CHEMBL306578
Type:
Small organic molecule
Emp. Form.:
C18H25N3O3
Mol. Mass.:
331.4094
SMILES:
CCCCCCc1ccc(Nc2cc(=O)[nH]c(=O)n2CCO)cc1
: