Target
Plasmepsin IV [1-448]
Ligand
BDBM50523412
Substrate
Meas. Tech.
ChEMBL_1890278 (CHEMBL4392032)
IC50
>10000±n/a nM
Citation
 Meyers, MJLiu, JXu, JLeng, FGuan, JLiu, ZMcNitt, SAQin, LDai, LMa, HAdah, DZhao, SLi, XPolino, AJNasamu, ASGoldberg, DELiu, XLu, YTu, ZChen, XTortorella, MD 4-Aryl Pyrrolidines as a Novel Class of Orally Efficacious Antimalarial Agents. Part 1: Evaluation of 4-Aryl- N-benzylpyrrolidine-3-carboxamides. J Med Chem 62:3503-3512 (2019)  
Target
Name:
Plasmepsin IV [1-448]
Synonyms:
PLM4_PLAF7 Plasmepsin 4 (PM-IV)
Type:
Enzyme
Mol. Mass.:
50925.00
Organism:
Plasmodium falciparum
Description:
Q8IM16[1-448]
Residue:
448
  
Inhibitor
Name:
BDBM50523412
Synonyms:
CHEMBL4567098
Type:
Small organic molecule
Emp. Form.:
C21H23ClF3N3O
Mol. Mass.:
425.875
SMILES:
CN(C)c1ccc(CNC(=O)[C@@H]2CNC[C@H]2c2ccc(c(Cl)c2)C(F)(F)F)cc1
: