Target
Potassium voltage-gated channel subfamily H member 2
Ligand
BDBM50523415
Substrate
Meas. Tech.
ChEMBL_1890282 (CHEMBL4392036)
IC50
4740±n/a nM
Citation
 Meyers, MJLiu, JXu, JLeng, FGuan, JLiu, ZMcNitt, SAQin, LDai, LMa, HAdah, DZhao, SLi, XPolino, AJNasamu, ASGoldberg, DELiu, XLu, YTu, ZChen, XTortorella, MD 4-Aryl Pyrrolidines as a Novel Class of Orally Efficacious Antimalarial Agents. Part 1: Evaluation of 4-Aryl- N-benzylpyrrolidine-3-carboxamides. J Med Chem 62:3503-3512 (2019)  
Target
Name:
Potassium voltage-gated channel subfamily H member 2
Synonyms:
1,3-beta-glucan synthase component GLS2 ERG Eag-related protein 1 Ether-a-go-go-related gene (HERG) Ether-a-go-go-related gene potassium channel 1 Ether-a-go-go-related gene potassium channel 1 (hERG1) Ether-a-go-go-related protein 1 H-ERG KCNH2 Potassium voltage-gated channel subfamily H member 2 (hERG) Voltage-gated potassium channel subunit Kv11.1 hERG Potassium Channel 1 | putative potassium channel subunit
Type:
Multi-pass membrane protein
Mol. Mass.:
126672.65
Organism:
Homo sapiens (Human)
Description:
Q12809
Residue:
1159
  
Inhibitor
Name:
BDBM50523415
Synonyms:
CHEMBL4515188
Type:
Small organic molecule
Emp. Form.:
C23H28F3N3O
Mol. Mass.:
419.4831
SMILES:
CCN(CC)c1ccc(CNC(=O)[C@@H]2CNC[C@H]2c2ccc(cc2)C(F)(F)F)cc1
: