Target
Beta-secretase 1
Ligand
BDBM50523411
Substrate
Meas. Tech.
ChEMBL_1890276 (CHEMBL4392030)
IC50
>10000±n/a nM
Citation
 Meyers, MJLiu, JXu, JLeng, FGuan, JLiu, ZMcNitt, SAQin, LDai, LMa, HAdah, DZhao, SLi, XPolino, AJNasamu, ASGoldberg, DELiu, XLu, YTu, ZChen, XTortorella, MD 4-Aryl Pyrrolidines as a Novel Class of Orally Efficacious Antimalarial Agents. Part 1: Evaluation of 4-Aryl- N-benzylpyrrolidine-3-carboxamides. J Med Chem 62:3503-3512 (2019)  
Target
Name:
Beta-secretase 1
Synonyms:
ASP2 Aspartyl protease 2 BACE1 Beta-secretase (BACE) Beta-secretase 1 (BACE 1) Beta-secretase 1 (BACE1) Beta-site amyloid precursor protein cleaving enzyme 1 Memapsin-2 beta-Secretase (BACE-1) | beta-Secretase (BACE1)
Type:
Protein
Mol. Mass.:
55755.10
Organism:
Homo sapiens (Human)
Description:
P56817
Residue:
501
  
Inhibitor
Name:
BDBM50523411
Synonyms:
CHEMBL4475207
Type:
Small organic molecule
Emp. Form.:
C20H23F3N4O
Mol. Mass.:
392.418
SMILES:
CN(C)c1ccc(CNC(=O)[C@H]2CNC[C@@H]2c2ccc(nc2)C(F)(F)F)cc1
: