Target
Plasmepsin II
Ligand
BDBM50523411
Substrate
Meas. Tech.
ChEMBL_1890277 (CHEMBL4392031)
IC50
>10000±n/a nM
Citation
 Meyers, MJLiu, JXu, JLeng, FGuan, JLiu, ZMcNitt, SAQin, LDai, LMa, HAdah, DZhao, SLi, XPolino, AJNasamu, ASGoldberg, DELiu, XLu, YTu, ZChen, XTortorella, MD 4-Aryl Pyrrolidines as a Novel Class of Orally Efficacious Antimalarial Agents. Part 1: Evaluation of 4-Aryl- N-benzylpyrrolidine-3-carboxamides. J Med Chem 62:3503-3512 (2019)  
Target
Name:
Plasmepsin II
Synonyms:
Aspartic hemoglobinase II PLM2_PLAFX Plasmepsin 2 Plasmepsin-II
Type:
Enzyme
Mol. Mass.:
51482.09
Organism:
Plasmodium falciparum
Description:
P46925
Residue:
453
  
Inhibitor
Name:
BDBM50523411
Synonyms:
CHEMBL4475207
Type:
Small organic molecule
Emp. Form.:
C20H23F3N4O
Mol. Mass.:
392.418
SMILES:
CN(C)c1ccc(CNC(=O)[C@H]2CNC[C@@H]2c2ccc(nc2)C(F)(F)F)cc1
: